BDBM50491892 CHEMBL3216338
SMILES Cl.Cl.[H][C@@]12Oc3c4c(C[C@@]5([H])N(CC6CC6)CC[C@@]14[C@@]51CC[C@@]2(O)[C@@H](N1)C(=O)Nc1ccccc1)ccc3O
InChI Key InChIKey=HAMGHYBKCRCASJ-BHQBEXKSSA-N
Data  3 KI
  Tab Delimited (TSV)   2D SDfile   Computed 3D by Vconf -m prep SDfile
Find this compound or compounds like it in BindingDB:
Activity Spreadsheet -- Enzyme Inhibition Constant Data from BindingDB
Found 1 hit for monomerid = 50491892
TargetKappa-type opioid receptor(Cavia porcellus (domestic guinea pig))
Kitasato University
Curated by ChEMBL
LigandPNGBDBM50491892(CHEMBL3216338)
Affinity DataKi:  0.110nM. Assay description: Displacement of [3H]U-69,593 from kappa opioid receptor in guinea pig cerebellum
Ligand InfoPC cidPC sid
In DepthDetails ArticlePubMed